Target
Glutamate receptor ionotropic, kainate 2
Ligand
BDBM50185318
Substrate
Meas. Tech.
ChEMBL_341794 (CHEMBL865634)
Ki
>100000±n/a nM
Citation
 Dolman, NPMore, JCAlt, AKnauss, JLTroop, HMBleakman, DCollingridge, GLJane, DE Structure-activity relationship studies on N3-substituted willardiine derivatives acting as AMPA or kainate receptor antagonists. J Med Chem 49:2579-92 (2006)  
Target
Name:
Glutamate receptor ionotropic, kainate 2
Synonyms:
GRIK2_RAT Glutamate receptor ionotropic kainate 2 Ionotropic glutamate receptor kainate 2/5
Type:
PROTEIN
Mol. Mass.:
102478.61
Organism:
Rattus norvegicus
Description:
ChEMBL_936439
Residue:
908
  
Inhibitor
Name:
BDBM50185318
Synonyms:
(S)-1-(2-amino-2-carboxyethyl)-3-(2-carboxythiophene-3-ylmethyl)pyrimidine-2,4-dione CHEMBL379442
Type:
Small organic molecule
Emp. Form.:
C13H13N3O6S
Mol. Mass.:
339.324
SMILES:
N[C@@H](Cn1ccc(=O)n(Cc2ccsc2C(O)=O)c1=O)C(O)=O
: