Target
Glutamate receptor ionotropic, kainate 3
Ligand
BDBM50185318
Substrate
Meas. Tech.
ChEMBL_341799 (CHEMBL864999)
IC50
264000±n/a nM
Citation
 Dolman, NPMore, JCAlt, AKnauss, JLTroop, HMBleakman, DCollingridge, GLJane, DE Structure-activity relationship studies on N3-substituted willardiine derivatives acting as AMPA or kainate receptor antagonists. J Med Chem 49:2579-92 (2006)  
Target
Name:
Glutamate receptor ionotropic, kainate 3
Synonyms:
EAA5 GLUR7 GRIK3_HUMAN Glutamate receptor 7 Glutamate receptor ionotropic kainate 3 Glutamate-Kainate 7
Type:
Enzyme Catalytic Domain
Mol. Mass.:
104046.44
Organism:
Homo sapiens (Human)
Description:
Glutamate-Kainate 7 0 HUMAN::Q13003
Residue:
919
  
Inhibitor
Name:
BDBM50185318
Synonyms:
(S)-1-(2-amino-2-carboxyethyl)-3-(2-carboxythiophene-3-ylmethyl)pyrimidine-2,4-dione CHEMBL379442
Type:
Small organic molecule
Emp. Form.:
C13H13N3O6S
Mol. Mass.:
339.324
SMILES:
N[C@@H](Cn1ccc(=O)n(Cc2ccsc2C(O)=O)c1=O)C(O)=O
: