Target
Glutamate receptor ionotropic, kainate 2
Ligand
BDBM50178141
Substrate
Meas. Tech.
ChEMBL_341794 (CHEMBL865634)
Ki
>100000±n/a nM
Citation
 Dolman, NPMore, JCAlt, AKnauss, JLTroop, HMBleakman, DCollingridge, GLJane, DE Structure-activity relationship studies on N3-substituted willardiine derivatives acting as AMPA or kainate receptor antagonists. J Med Chem 49:2579-92 (2006)  
Target
Name:
Glutamate receptor ionotropic, kainate 2
Synonyms:
GRIK2_RAT Glutamate receptor ionotropic kainate 2 Ionotropic glutamate receptor kainate 2/5
Type:
PROTEIN
Mol. Mass.:
102478.61
Organism:
Rattus norvegicus
Description:
ChEMBL_936439
Residue:
908
  
Inhibitor
Name:
BDBM50178141
Synonyms:
(S)-1-(2-amino-2-carboxyethyl)-3-(4-carboxybenzyl)pyrimidine-2,4-dione CHEMBL200337
Type:
Small organic molecule
Emp. Form.:
C15H15N3O6
Mol. Mass.:
333.2961
SMILES:
N[C@@H](Cn1ccc(=O)n(Cc2ccc(cc2)C(O)=O)c1=O)C(O)=O
: