Target
AP2-associated protein kinase 1
Ligand
BDBM311180
Substrate
Meas. Tech.
ChEMBL_2246936 (CHEMBL5161146)
Ki
0.040000±n/a nM
Citation
 Luo, GChen, LKostich, WAHamman, BAllen, JEaston, ABourin, CGulianello, MLippy, JNara, SPattipati, SNDandapani, KDokania, MVattikundala, PSharma, VElavazhagan, SVerma, MKLal Das, MWagh, SBalakrishnan, AJohnson, BMSantone, KSThalody, GDenton, RSaminathan, HHolenarsipur, VKKumar, ARao, APutlur, SPSarvasiddhi, SKShankar, GLouis, JVRamarao, MConway, CMLi, YWPieschl, RTian, YHong, YBristow, LAlbright, CFBronson, JJMacor, JEDzierba, CD Discovery and Optimization of Biaryl Alkyl Ethers as a Novel Class of Highly Selective, CNS-Penetrable, and Orally Active Adaptor Protein-2-Associated Kinase 1 (AAK1) Inhibitors for the Potential Treatment of Neuropathic Pain. J Med Chem 65:4534-4564 (2022) Target
Name:
AP2-associated protein kinase 1
Synonyms:
2.7.11.1 Aak1 Kiaa1048
Type:
PROTEIN
Mol. Mass.:
103346.52
Organism:
Mus musculus
Description:
ChEMBL_120693
Residue:
959
  
Inhibitor
Name:
BDBM311180
Synonyms:
(S)-methyl (4-(4-((2-amino-2,4-dimethylpentyl)oxy)-3-(difluoromethyl)phenyl)pyridin-2-yl)carbamate US10351563, Example 24 US10723734, Example 24 US9902722, Example 24
Type:
Small organic molecule
Emp. Form.:
C21H27F2N3O3
Mol. Mass.:
407.4542
SMILES:
COC(=O)Nc1cc(ccn1)-c1ccc(OC[C@@](C)(N)CC(C)C)c(c1)C(F)F
: