Target
S-adenosylmethionine synthase isoform type-2
Ligand
BDBM50604360
Substrate
Meas. Tech.
ChEMBL_2247527 (CHEMBL5161737)
IC50
13±n/a nM
Citation
 Li, MKonteatis, ZNagaraja, NChen, YZhou, SMa, GGross, SMarjon, KHyer, MLMandley, ELein, MPadyana, AKJin, LTong, SPeters, RMurtie, JTravins, JMedeiros, MLiu, PFrank, VJudd, ETBiller, SAMarks, KMSui, ZReznik, SK Leveraging Structure-Based Drug Design to Identify Next-Generation MAT2A Inhibitors, Including Brain-Penetrant and Peripherally Efficacious Leads. J Med Chem 65:4600-4615 (2022) Target
Name:
S-adenosylmethionine synthase isoform type-2
Synonyms:
AMS2 MAT 2 MAT2A METK2_HUMAN Methionine adenosyltransferase II
Type:
Protein
Mol. Mass.:
43659.65
Organism:
Human
Description:
P31153
Residue:
395
  
Inhibitor
Name:
BDBM50604360
Synonyms:
CHEMBL5187048
Type:
Small organic molecule
Emp. Form.:
C24H17ClF2N4O2
Mol. Mass.:
466.867
SMILES:
Cn1cc2cc(ccc2n1)-n1cc2ccc(OCC(F)F)nc2c(-c2ccc(Cl)cc2)c1=O
: