Target
Cytochrome c oxidase subunit 1
Ligand
BDBM50140321
Substrate
Meas. Tech.
ChEMBL_2248534 (CHEMBL5162744)
IC50
1470±n/a nM
Citation
 Ye, HLv, TMin, TMao, DChen, XDing, BZhang, C HR1405-01, a Safe intravenous NSAID with superior anti-inflammatory and analgesic activities in preclinical trials. Eur J Med Chem 235:0 (2022) Target
Name:
Cytochrome c oxidase subunit 1
Synonyms:
COI COXI MTCO1
Type:
PROTEIN
Mol. Mass.:
57042.74
Organism:
Homo sapiens (Human)
Description:
ChEMBL_746069
Residue:
513
  
Inhibitor
Name:
BDBM50140321
Synonyms:
(S)-2-[4-((1R,2S)-2-Hydroxy-cyclopentylmethyl)-phenyl]-propionic acid | CHEMBL441414
Type:
Small organic molecule
Emp. Form.:
C15H20O3
Mol. Mass.:
248.3175
SMILES:
C[C@H](C(O)=O)c1ccc(C[C@H]2CCC[C@@H]2O)cc1
: