Target
Deoxyuridine triphosphatase, putative
Ligand
BDBM50186265
Substrate
Meas. Tech.
ChEMBL_366108 (CHEMBL864792)
Ki
>1000000±n/a nM
Citation
 Mc Carthy, OKSchipani, ABuendía, AMRuiz-Perez, LMKaiser, MBrun, RPacanowska, DGGilbert, IH Design, synthesis and evaluation of novel uracil amino acid conjugates for the inhibition of Trypanosoma cruzi dUTPase. Bioorg Med Chem Lett 16:3809-12 (2006)  
Target
Name:
Deoxyuridine triphosphatase, putative
Synonyms:
Deoxyuridine triphosphatase
Type:
PROTEIN
Mol. Mass.:
38920.01
Organism:
Trypanosoma cruzi
Description:
ChEMBL_366108
Residue:
340
  
Inhibitor
Name:
BDBM50186265
Synonyms:
(S)-2-(2-(2-(2,4-dioxo-3,4-dihydropyrimidin-1(2H)-yl)acetamido)propanamido)acetic acid | CHEMBL208995
Type:
Small organic molecule
Emp. Form.:
C11H14N4O6
Mol. Mass.:
298.2521
SMILES:
C[C@H](NC(=O)Cn1ccc(=O)[nH]c1=O)C(=O)NCC(O)=O
: