Target
Histamine H3 receptor
Ligand
BDBM50186297
Substrate
Meas. Tech.
ChEMBL_370711 (CHEMBL867234)
Ki
32.5±n/a nM
Citation
 Jesudason, CDBeavers, LSCramer, JWDill, JFinley, DRLindsley, CWStevens, FCGadski, RAOldham, SWPickard, RTSiedem, CSSindelar, DKSingh, AWatson, BMHipskind, PA Synthesis and SAR of novel histamine H3 receptor antagonists. Bioorg Med Chem Lett 16:3415-8 (2006)  
Target
Name:
Histamine H3 receptor
Synonyms:
HH3R Hrh3
Type:
G Protein-Coupled Receptor (GPCR)
Mol. Mass.:
48607.98
Organism:
Rattus norvegicus (rat)
Description:
Residue:
445
  
Inhibitor
Name:
BDBM50186297
Synonyms:
CHEMBL209099 | N-isopropyl-7-(3-(piperidin-1-yl)propoxy)-4,5-dihydro-1H-benzo[c]azepine-2(3H)-carboxamide
Type:
Small organic molecule
Emp. Form.:
C22H35N3O2
Mol. Mass.:
373.5322
SMILES:
CC(C)NC(=O)N1CCCc2cc(OCCCN3CCCCC3)ccc2C1
: