Target
Phospholipase A2 group V
Ligand
BDBM50055366
Substrate
Meas. Tech.
ChEMBL_352639 (CHEMBL862131)
IC50
750±n/a nM
Citation
 Smart, BPOslund, RCWalsh, LAGelb, MH The first potent inhibitor of mammalian group X secreted phospholipase A2: elucidation of sites for enhanced binding. J Med Chem 49:2858-60 (2006)  
Target
Name:
Phospholipase A2 group V
Synonyms:
PA2G5_MOUSE | Pla2g5
Type:
PROTEIN
Mol. Mass.:
15864.30
Organism:
Mus musculus
Description:
ChEMBL_700980
Residue:
137
  
Inhibitor
Name:
BDBM50055366
Synonyms:
(3-Aminooxalyl-1-benzyl-2-ethyl-1H-indol-4-yloxy)-acetic acid 2-(3-(2-amino-2-oxoacetyl)-1-benzyl-2-ethyl-1H-indol-4-yloxy)acetic acid Varespladib sodium
Type:
Small organic molecule
Emp. Form.:
C21H20N2O5
Mol. Mass.:
380.3939
SMILES:
CCc1c(C(=O)C(N)=O)c2c(OCC(O)=O)cccc2n1Cc1ccccc1
: