Target
Cathepsin S
Ligand
BDBM50186698
Substrate
Meas. Tech.
ChEMBL_353298 (CHEMBL861977)
IC50
7100±n/a nM
Citation
 Rydzewski, RMBurrill, LMendonca, RPalmer, JTRice, MTahilramani, RBass, KELeung, LGjerstad, EJanc, JWPan, L Optimization of subsite binding to the beta5 subunit of the human 20S proteasome using vinyl sulfones and 2-keto-1,3,4-oxadiazoles: syntheses and cellular properties of potent, selective proteasome inhibitors. J Med Chem 49:2953-68 (2006)  
Target
Name:
Cathepsin S
Synonyms:
CATS_HUMAN Cathepsin S (Cat S) | cathepsin S preproprotein
Type:
Protein
Mol. Mass.:
37507.38
Organism:
Homo sapiens (Human)
Description:
P25774
Residue:
331
  
Inhibitor
Name:
BDBM50186698
Synonyms:
CHEMBL207196 | Cbz-Ile-t-ButylhomoGlu-Ala-LeuVSMe
Type:
Small organic molecule
Emp. Form.:
C35H56N4O9S
Mol. Mass.:
708.906
SMILES:
CC[C@H](C)[C@H](NC(=O)OCc1ccccc1)C(=O)N[C@@H](CCCC(=O)OC(C)(C)C)C(=O)N[C@@H](C)C(=O)N[C@@H](CC(C)C)C=CS(C)(=O)=O
: