Target
alpha-1,2-Mannosidase
Ligand
BDBM50186736
Substrate
Meas. Tech.
ChEMBL_353423 (CHEMBL861357)
pH
6.8±n/a
Ki
>1000000±n/a nM
Comments
extracted
Citation
 Wang, RWQiu, XLBols, MOrtega-Caballero, FQing, FL Synthesis and biological evaluation of glycosidase inhibitors: gem-difluoromethylenated nojirimycin analogues. J Med Chem 49:2989-97 (2006)  
Target
Name:
alpha-1,2-Mannosidase
Synonyms:
Alpha-mannosidase
Type:
PROTEIN
Mol. Mass.:
65344.50
Organism:
Glycine max
Description:
ChEMBL_32380
Residue:
578
  
Inhibitor
Name:
BDBM50186736
Synonyms:
CHEMBL380311 | L-1,4-dideoxy-4,4-difluorogulonojirimycin
Type:
Small organic molecule
Emp. Form.:
C6H11F2NO3
Mol. Mass.:
183.1532
SMILES:
OC[C@@H]1NC[C@@H](O)[C@@H](O)C1(F)F
: