Target
Melanin-concentrating hormone receptor 1
Ligand
BDBM50186786
Substrate
Meas. Tech.
ChEMBL_376788 (CHEMBL867266)
Ki
13±n/a nM
Citation
 Wu, WLBurnett, DASpring, RQiang, LSasikumar, TKDomalski, MSGreenlee, WJO'Neill, KHawes, BE Synthesis and structure-activity relationships of piperidine-based melanin-concentrating hormone receptor 1 antagonists. Bioorg Med Chem Lett 16:3668-73 (2006)  
Target
Name:
Melanin-concentrating hormone receptor 1
Synonyms:
G-protein coupled receptor 24 MCH receptor 1 MCH-R1 MCHR-1 MCHR1_HUMAN Melanin-Concentrating Hormone Receptor 1 (MCH1R) Melanin-concentrating hormone receptor 1 (MCH-1) Melanin-concentrating hormone receptor 1 (MCHR-1) SLC-1 Somatostatin receptor-like protein
Type:
G Protein-Coupled Receptor (GPCR)
Mol. Mass.:
45976.27
Organism:
Homo sapiens (Human)
Description:
Membranes from CHO-K1 cells stably expressing human MCH1R were used in assays.
Residue:
422
  
Inhibitor
Name:
BDBM50186786
Synonyms:
3-[4-(3'-cyano-biphenyl-4-yl)-1-cyclopentyl-piperidin-4-yl]-N-(3,4-difluoro-phenyl)-propionamide | CHEMBL209089
Type:
Small organic molecule
Emp. Form.:
C32H33F2N3O
Mol. Mass.:
513.6207
SMILES:
Fc1ccc(NC(=O)CCC2(CCN(CC2)C2CCCC2)c2ccc(cc2)-c2cccc(c2)C#N)cc1F
: