Target
Melanin-concentrating hormone receptor 1
Ligand
BDBM50186788
Substrate
Meas. Tech.
ChEMBL_376788 (CHEMBL867266)
Ki
16±n/a nM
Citation
 Wu, WLBurnett, DASpring, RQiang, LSasikumar, TKDomalski, MSGreenlee, WJO'Neill, KHawes, BE Synthesis and structure-activity relationships of piperidine-based melanin-concentrating hormone receptor 1 antagonists. Bioorg Med Chem Lett 16:3668-73 (2006)  
Target
Name:
Melanin-concentrating hormone receptor 1
Synonyms:
G-protein coupled receptor 24 MCH receptor 1 MCH-R1 MCHR-1 MCHR1_HUMAN Melanin-Concentrating Hormone Receptor 1 (MCH1R) Melanin-concentrating hormone receptor 1 (MCH-1) Melanin-concentrating hormone receptor 1 (MCHR-1) SLC-1 Somatostatin receptor-like protein
Type:
G Protein-Coupled Receptor (GPCR)
Mol. Mass.:
45976.27
Organism:
Homo sapiens (Human)
Description:
Membranes from CHO-K1 cells stably expressing human MCH1R were used in assays.
Residue:
422
  
Inhibitor
Name:
BDBM50186788
Synonyms:
2-{[4-(3'-cyano-biphenyl-4-yl)-1-cyclopentyl-piperidin-4-yl]-methyl-amino}-N-(3,5-dichloro-phenyl)-acetamide | CHEMBL379489
Type:
Small organic molecule
Emp. Form.:
C33H34ClF3N4O
Mol. Mass.:
595.097
SMILES:
CN(CC(=O)Nc1ccc(Cl)c(c1)C(F)(F)F)C1(CCN(CC1)C1CCCC1)c1ccc(cc1)-c1cccc(c1)C#N
: