Target
Melanin-concentrating hormone receptor 1
Ligand
BDBM50186822
Substrate
Meas. Tech.
ChEMBL_376788 (CHEMBL867266)
Ki
20±n/a nM
Citation
 Wu, WLBurnett, DASpring, RQiang, LSasikumar, TKDomalski, MSGreenlee, WJO'Neill, KHawes, BE Synthesis and structure-activity relationships of piperidine-based melanin-concentrating hormone receptor 1 antagonists. Bioorg Med Chem Lett 16:3668-73 (2006)  
Target
Name:
Melanin-concentrating hormone receptor 1
Synonyms:
G-protein coupled receptor 24 MCH receptor 1 MCH-R1 MCHR-1 MCHR1_HUMAN Melanin-Concentrating Hormone Receptor 1 (MCH1R) Melanin-concentrating hormone receptor 1 (MCH-1) Melanin-concentrating hormone receptor 1 (MCHR-1) SLC-1 Somatostatin receptor-like protein
Type:
G Protein-Coupled Receptor (GPCR)
Mol. Mass.:
45976.27
Organism:
Homo sapiens (Human)
Description:
Membranes from CHO-K1 cells stably expressing human MCH1R were used in assays.
Residue:
422
  
Inhibitor
Name:
BDBM50186822
Synonyms:
4'-{[(6-chloro-5-fluoro-1H-benzoimidazol-2-ylmethyl)-amino]-piperidin-4-yl-methyl}-biphenyl-3-carbonitrile | CHEMBL376976
Type:
Small organic molecule
Emp. Form.:
C27H25ClFN5
Mol. Mass.:
473.972
SMILES:
Fc1cc2[nH]c(CNC(C3CCNCC3)c3ccc(cc3)-c3cccc(c3)C#N)nc2cc1Cl
: