Target
Melanin-concentrating hormone receptor 1
Ligand
BDBM50186800
Substrate
Meas. Tech.
ChEMBL_376788 (CHEMBL867266)
Ki
26±n/a nM
Citation
 Wu, WLBurnett, DASpring, RQiang, LSasikumar, TKDomalski, MSGreenlee, WJO'Neill, KHawes, BE Synthesis and structure-activity relationships of piperidine-based melanin-concentrating hormone receptor 1 antagonists. Bioorg Med Chem Lett 16:3668-73 (2006)  
Target
Name:
Melanin-concentrating hormone receptor 1
Synonyms:
G-protein coupled receptor 24 MCH receptor 1 MCH-R1 MCHR-1 MCHR1_HUMAN Melanin-Concentrating Hormone Receptor 1 (MCH1R) Melanin-concentrating hormone receptor 1 (MCH-1) Melanin-concentrating hormone receptor 1 (MCHR-1) SLC-1 Somatostatin receptor-like protein
Type:
G Protein-Coupled Receptor (GPCR)
Mol. Mass.:
45976.27
Organism:
Homo sapiens (Human)
Description:
Membranes from CHO-K1 cells stably expressing human MCH1R were used in assays.
Residue:
422
  
Inhibitor
Name:
BDBM50186800
Synonyms:
4'-[1-(1-benzyl-piperidin-4-yl)-3-(4,6-dichloro-1H-benzoimidazol-2-yl)-propyl]-biphenyl-3-carbonitrile CHEMBL377874
Type:
Small organic molecule
Emp. Form.:
C35H32Cl2N4
Mol. Mass.:
579.561
SMILES:
Clc1cc(Cl)c2[nH]c(CCC(C3CCN(Cc4ccccc4)CC3)c3ccc(cc3)-c3cccc(c3)C#N)nc2c1
: