Target
Melanin-concentrating hormone receptor 1
Ligand
BDBM50186823
Substrate
Meas. Tech.
ChEMBL_376573 (CHEMBL866622)
Ki
20±n/a nM
Citation
 Wu, WLBurnett, DACaplen, MADomalski, MSBennett, CGreenlee, WJHawes, BEO'Neill, KWeig, BWeston, DSpar, BKowalski, T Design and synthesis of orally efficacious benzimidazoles as melanin-concentrating hormone receptor 1 antagonists. Bioorg Med Chem Lett 16:3674-8 (2006)  
Target
Name:
Melanin-concentrating hormone receptor 1
Synonyms:
G-protein coupled receptor 24 MCH receptor 1 MCH-R1 MCHR-1 MCHR1_HUMAN Melanin-Concentrating Hormone Receptor 1 (MCH1R) Melanin-concentrating hormone receptor 1 (MCH-1) Melanin-concentrating hormone receptor 1 (MCHR-1) SLC-1 Somatostatin receptor-like protein
Type:
G Protein-Coupled Receptor (GPCR)
Mol. Mass.:
45976.27
Organism:
Homo sapiens (Human)
Description:
Membranes from CHO-K1 cells stably expressing human MCH1R were used in assays.
Residue:
422
  
Inhibitor
Name:
BDBM50186823
Synonyms:
4'-{(5-fluoro-6-trifluoromethyl-1H-benzoimidazol-2-yl)-[1-(thiophene-2-carbonyl)-piperidin-4-ylidene]-methyl}-biphenyl-3-carbonitrile | CHEMBL377864
Type:
Small organic molecule
Emp. Form.:
C32H22F4N4OS
Mol. Mass.:
586.602
SMILES:
Fc1cc2[nH]c(nc2cc1C(F)(F)F)C(=C1CCN(CC1)C(=O)c1cccs1)c1ccc(cc1)-c1cccc(c1)C#N
: