Target
Melanin-concentrating hormone receptor 1
Ligand
BDBM50186830
Substrate
Meas. Tech.
ChEMBL_376573 (CHEMBL866622)
Ki
15±n/a nM
Citation
 Wu, WLBurnett, DACaplen, MADomalski, MSBennett, CGreenlee, WJHawes, BEO'Neill, KWeig, BWeston, DSpar, BKowalski, T Design and synthesis of orally efficacious benzimidazoles as melanin-concentrating hormone receptor 1 antagonists. Bioorg Med Chem Lett 16:3674-8 (2006)  
Target
Name:
Melanin-concentrating hormone receptor 1
Synonyms:
G-protein coupled receptor 24 MCH receptor 1 MCH-R1 MCHR-1 MCHR1_HUMAN Melanin-Concentrating Hormone Receptor 1 (MCH1R) Melanin-concentrating hormone receptor 1 (MCH-1) Melanin-concentrating hormone receptor 1 (MCHR-1) SLC-1 Somatostatin receptor-like protein
Type:
G Protein-Coupled Receptor (GPCR)
Mol. Mass.:
45976.27
Organism:
Homo sapiens (Human)
Description:
Membranes from CHO-K1 cells stably expressing human MCH1R were used in assays.
Residue:
422
  
Inhibitor
Name:
BDBM50186830
Synonyms:
4'-[(1-cyclopropylmethyl-piperidin-4-ylidene)-(5,6-dichloro-1H-benzoimidazol-2-yl)-methyl]-biphenyl-3-carbonitrile | CHEMBL211820
Type:
Small organic molecule
Emp. Form.:
C30H26Cl2N4
Mol. Mass.:
513.46
SMILES:
Clc1cc2nc([nH]c2cc1Cl)C(=C1CCN(CC2CC2)CC1)c1ccc(cc1)-c1cccc(c1)C#N
: