Target
Melanin-concentrating hormone receptor 1
Ligand
BDBM50186844
Substrate
Meas. Tech.
ChEMBL_376573 (CHEMBL866622)
Ki
31±n/a nM
Citation
 Wu, WLBurnett, DACaplen, MADomalski, MSBennett, CGreenlee, WJHawes, BEO'Neill, KWeig, BWeston, DSpar, BKowalski, T Design and synthesis of orally efficacious benzimidazoles as melanin-concentrating hormone receptor 1 antagonists. Bioorg Med Chem Lett 16:3674-8 (2006)  
Target
Name:
Melanin-concentrating hormone receptor 1
Synonyms:
G-protein coupled receptor 24 MCH receptor 1 MCH-R1 MCHR-1 MCHR1_HUMAN Melanin-Concentrating Hormone Receptor 1 (MCH1R) Melanin-concentrating hormone receptor 1 (MCH-1) Melanin-concentrating hormone receptor 1 (MCHR-1) SLC-1 Somatostatin receptor-like protein
Type:
G Protein-Coupled Receptor (GPCR)
Mol. Mass.:
45976.27
Organism:
Homo sapiens (Human)
Description:
Membranes from CHO-K1 cells stably expressing human MCH1R were used in assays.
Residue:
422
  
Inhibitor
Name:
BDBM50186844
Synonyms:
4'-[(1-acetyl-piperidin-4-ylidene)-(5-fluoro-6-trifluoromethyl-1H-benzoimidazol-2-yl)-methyl]-biphenyl-3-carbonitrile | CHEMBL208573
Type:
Small organic molecule
Emp. Form.:
C29H22F4N4O
Mol. Mass.:
518.5048
SMILES:
CC(=O)N1CCC(CC1)=C(c1nc2cc(c(F)cc2[nH]1)C(F)(F)F)c1ccc(cc1)-c1cccc(c1)C#N
: