Target
Melanin-concentrating hormone receptor 1
Ligand
BDBM50186855
Substrate
Meas. Tech.
ChEMBL_376573 (CHEMBL866622)
Ki
32±n/a nM
Citation
 Wu, WLBurnett, DACaplen, MADomalski, MSBennett, CGreenlee, WJHawes, BEO'Neill, KWeig, BWeston, DSpar, BKowalski, T Design and synthesis of orally efficacious benzimidazoles as melanin-concentrating hormone receptor 1 antagonists. Bioorg Med Chem Lett 16:3674-8 (2006)  
Target
Name:
Melanin-concentrating hormone receptor 1
Synonyms:
G-protein coupled receptor 24 MCH receptor 1 MCH-R1 MCHR-1 MCHR1_HUMAN Melanin-Concentrating Hormone Receptor 1 (MCH1R) Melanin-concentrating hormone receptor 1 (MCH-1) Melanin-concentrating hormone receptor 1 (MCHR-1) SLC-1 Somatostatin receptor-like protein
Type:
G Protein-Coupled Receptor (GPCR)
Mol. Mass.:
45976.27
Organism:
Homo sapiens (Human)
Description:
Membranes from CHO-K1 cells stably expressing human MCH1R were used in assays.
Residue:
422
  
Inhibitor
Name:
BDBM50186855
Synonyms:
1-(3'-cyano-biphenyl-4-yl)-1-(5-fluoro-6-trifluoromethyl-1H-benzoimidazol-2-yl)-6-aza-spiro[2.5]octane-6-carboxylic acid dimethylamide | CHEMBL208931
Type:
Small organic molecule
Emp. Form.:
C31H27F4N5O
Mol. Mass.:
561.5726
SMILES:
CN(C)C(=O)N1CCC2(CC2(c2nc3cc(c(F)cc3[nH]2)C(F)(F)F)c2ccc(cc2)-c2cccc(c2)C#N)CC1
: