Target
Adenosine receptor A1
Ligand
BDBM50186975
Substrate
Meas. Tech.
ChEMBL_376054 (CHEMBL864808)
IC50
101±n/a nM
Citation
 Esteve, CNueda, ADíaz, JLBeleta, JCárdenas, ALozoya, ECadavid, MILoza, MIRyder, HVidal, B New pyrrolopyrimidin-6-yl benzenesulfonamides: potent A2B adenosine receptor antagonists. Bioorg Med Chem Lett 16:3642-5 (2006)  
Target
Name:
Adenosine receptor A1
Synonyms:
A1 adenosine receptor (hA1) AA1R_HUMAN ADORA1 Adenosine A1-receptor Adenosine receptor A1 (hA1) | Adenosine transporter (AdT)
Type:
G Protein-Coupled Receptor (GPCR)
Mol. Mass.:
36520.92
Organism:
Homo sapiens (Human)
Description:
P30542
Residue:
326
  
Inhibitor
Name:
BDBM50186975
Synonyms:
4-(1,3-dimethyl-2,4-dioxo-2,3,4,5-tetrahydro-1H-pyrrolo[3,2-d]pyrimidin-6-yl)-N-((5-methoxypyridin-2-yl)methyl)benzenesulfonamide | CHEMBL210457
Type:
Small organic molecule
Emp. Form.:
C21H21N5O5S
Mol. Mass.:
455.487
SMILES:
COc1ccc(CNS(=O)(=O)c2ccc(cc2)-c2cc3n(C)c(=O)n(C)c(=O)c3[nH]2)nc1
: