Target
E3 ubiquitin-protein ligase Mdm2
Ligand
BDBM50605104
Substrate
Meas. Tech.
ChEMBL_2250432 (CHEMBL5164642)
IC50
<0.100000±n/a nM
Citation
 Zhang, SYan, ZLi, YGong, YLyu, XLou, JZhang, DMeng, XZhao, Y Structure-Based Discovery of MDM2/4 Dual Inhibitors that Exert Antitumor Activities against MDM4-Overexpressing Cancer Cells. J Med Chem 65:6207-6230 (2022) Target
Name:
E3 ubiquitin-protein ligase Mdm2
Synonyms:
Double minute 2 protein E3 ubiquitin-protein ligase Mdm2 (p53-binding protein Mdm2) Human Double Minute 2 (HDM2) MDM2-MDMX p53-Binding Protein MDM2 | p53-binding protein
Type:
Oncoprotein
Mol. Mass.:
55196.54
Organism:
Homo sapiens (Human)
Description:
Q00987
Residue:
491
  
Inhibitor
Name:
BDBM50605104
Synonyms:
CHEMBL5180980
Type:
Small organic molecule
Emp. Form.:
C42H37Cl3N6O5
Mol. Mass.:
812.139
SMILES:
C[C@@H](c1ccc(Cl)cc1Cl)n1cnc(c1-c1c([nH]c2cc(Cl)ccc12)C(=O)Nc1cc(ccc1N1CCC(CC1)N1CCCOC1=O)C(O)=O)-c1ccccc1
: