Target
Advanced glycosylation end product-specific receptor
Ligand
BDBM50605303
Substrate
Meas. Tech.
ChEMBL_2250939 (CHEMBL5165149)
IC50
12490±n/a nM
Citation
 Zhang, CWang, LXu, YHuang, YHuang, JZhu, JWang, WLi, WSun, ALi, XZhang, HLi, J Discovery of novel dual RAGE/SERT inhibitors for the potential treatment of the comorbidity of Alzheimer's disease and depression. Eur J Med Chem 236:0 (2022) Target
Name:
Advanced glycosylation end product-specific receptor
Synonyms:
AGER RAGE_HUMAN | Receptor for advanced glycosylation end products
Type:
PROTEIN
Mol. Mass.:
42800.11
Organism:
Homo sapiens (Human)
Description:
ChEMBL_1339877
Residue:
404
  
Inhibitor
Name:
BDBM50605303
Synonyms:
CHEMBL5208902
Type:
Small organic molecule
Emp. Form.:
C36H38ClN5O
Mol. Mass.:
592.173
SMILES:
CCCc1nc(cn1-c1ccc(Oc2ccc(Cl)cc2)cc1)C1CCN(CCCCc2c[nH]c3ccc(cc23)C#N)CC1
: