Target
WD repeat-containing protein 5
Ligand
BDBM50520131
Substrate
Meas. Tech.
ChEMBL_2250988 (CHEMBL5165198)
Ki
<0.020000±n/a nM
Citation
 Teuscher, KBMeyers, KMWei, QMills, JJTian, JAlvarado, JSai, JVan Meveren, MSouth, TMRietz, TAZhao, BMoore, WJStott, GMTansey, WPLee, TFesik, SW Discovery of Potent Orally Bioavailable WD Repeat Domain 5 (WDR5) Inhibitors Using a Pharmacophore-Based Optimization. J Med Chem 65:6287-6312 (2022) Target
Name:
WD repeat-containing protein 5
Synonyms:
BIG3 WD repeat-containing protein 5 (WDR5) WDR5 | WDR5_HUMAN
Type:
Protein
Mol. Mass.:
36597.13
Organism:
Homo sapiens (Human)
Description:
P61964
Residue:
334
  
Inhibitor
Name:
BDBM50520131
Synonyms:
CHEMBL4588661
Type:
Small organic molecule
Emp. Form.:
C30H31FN4O3
Mol. Mass.:
514.5905
SMILES:
COc1cc(CN2CCc3c(cc(Cn4ccn(C)c4=N)cc3-c3ccc(F)cc3C)C2=O)cc(OC)c1
: