Target
WD repeat-containing protein 5
Ligand
BDBM50605337
Substrate
Meas. Tech.
ChEMBL_2250997 (CHEMBL5165207)
Ki
0.028000±n/a nM
Citation
 Teuscher, KBMeyers, KMWei, QMills, JJTian, JAlvarado, JSai, JVan Meveren, MSouth, TMRietz, TAZhao, BMoore, WJStott, GMTansey, WPLee, TFesik, SW Discovery of Potent Orally Bioavailable WD Repeat Domain 5 (WDR5) Inhibitors Using a Pharmacophore-Based Optimization. J Med Chem 65:6287-6312 (2022) Target
Name:
WD repeat-containing protein 5
Synonyms:
BIG3 WD repeat-containing protein 5 (WDR5) WDR5 | WDR5_HUMAN
Type:
Protein
Mol. Mass.:
36597.13
Organism:
Homo sapiens (Human)
Description:
P61964
Residue:
334
  
Inhibitor
Name:
BDBM50605337
Synonyms:
CHEMBL5192283
Type:
Small organic molecule
Emp. Form.:
C29H30F3N5O3
Mol. Mass.:
553.5754
SMILES:
CCc1nccn1Cc1cc(-c2cn(C)nc2C(F)(F)F)c2CCN(Cc3cc(OC)cc(OC)c3)C(=O)c2c1
: