Target
WD repeat-containing protein 5
Ligand
BDBM50605351
Substrate
Meas. Tech.
ChEMBL_2250997 (CHEMBL5165207)
Ki
0.029000±n/a nM
Citation
 Teuscher, KBMeyers, KMWei, QMills, JJTian, JAlvarado, JSai, JVan Meveren, MSouth, TMRietz, TAZhao, BMoore, WJStott, GMTansey, WPLee, TFesik, SW Discovery of Potent Orally Bioavailable WD Repeat Domain 5 (WDR5) Inhibitors Using a Pharmacophore-Based Optimization. J Med Chem 65:6287-6312 (2022) Target
Name:
WD repeat-containing protein 5
Synonyms:
BIG3 WD repeat-containing protein 5 (WDR5) WDR5 | WDR5_HUMAN
Type:
Protein
Mol. Mass.:
36597.13
Organism:
Homo sapiens (Human)
Description:
P61964
Residue:
334
  
Inhibitor
Name:
BDBM50605351
Synonyms:
CHEMBL5180435
Type:
Small organic molecule
Emp. Form.:
C28H29F3N6O2
Mol. Mass.:
538.5641
SMILES:
CCn1cc(c(n1)C(F)(F)F)-c1cc(Cn2ccnc2C)cc2C(=O)N(CCc12)[C@H](C)c1cc(OC)ccn1
: