Target
5-hydroxytryptamine receptor 2C
Ligand
BDBM50187377
Substrate
Meas. Tech.
ChEMBL_357761 (CHEMBL859018)
Ki
>5000±n/a nM
Citation
 Becker, OMDhanoa, DSMarantz, YChen, DShacham, SCheruku, SHeifetz, AMohanty, PFichman, MSharadendu, ANudelman, RKauffman, MNoiman, S An integrated in silico 3D model-driven discovery of a novel, potent, and selective amidosulfonamide 5-HT1A agonist (PRX-00023) for the treatment of anxiety and depression. J Med Chem 49:3116-35 (2006)  
Target
Name:
5-hydroxytryptamine receptor 2C
Synonyms:
5-HT-1C 5-HT1C 5-HT2C-INI 5-HTR2C 5-hydroxytryptamine receptor 2C (5-HT-2C) 5HT-1C HTR1C Serotonin (5-HT3) receptor Serotonin Receptor 2C
Type:
G Protein-Coupled Receptor (GPCR)
Mol. Mass.:
51836.79
Organism:
Homo sapiens (Human)
Description:
P28335
Residue:
458
  
Inhibitor
Name:
BDBM50187377
Synonyms:
CHEMBL209821 N-{3-[4-(4-cyclohexylmethanesulfonylamino-butyl)-piperazin-1-yl]-phenyl}-acetamide
Type:
Small organic molecule
Emp. Form.:
C23H38N4O3S
Mol. Mass.:
450.638
SMILES:
CC(=O)Nc1cccc(c1)N1CCN(CCCCNS(=O)(=O)CC2CCCCC2)CC1
: