Target
5-hydroxytryptamine receptor 5A
Ligand
BDBM50187377
Substrate
Meas. Tech.
ChEMBL_357764 (CHEMBL859021)
Ki
>5000±n/a nM
Citation
 Becker, OMDhanoa, DSMarantz, YChen, DShacham, SCheruku, SHeifetz, AMohanty, PFichman, MSharadendu, ANudelman, RKauffman, MNoiman, S An integrated in silico 3D model-driven discovery of a novel, potent, and selective amidosulfonamide 5-HT1A agonist (PRX-00023) for the treatment of anxiety and depression. J Med Chem 49:3116-35 (2006)  
Target
Name:
5-hydroxytryptamine receptor 5A
Synonyms:
5-HT-5 5-hydroxytryptamine receptor 5 (5-HT5) 5HT5A_HUMAN Serotonin (5-HT) receptor | Serotonin receptor 5A
Type:
Enzyme
Mol. Mass.:
40266.25
Organism:
Homo sapiens (Human)
Description:
P47898
Residue:
357
  
Inhibitor
Name:
BDBM50187377
Synonyms:
CHEMBL209821 N-{3-[4-(4-cyclohexylmethanesulfonylamino-butyl)-piperazin-1-yl]-phenyl}-acetamide
Type:
Small organic molecule
Emp. Form.:
C23H38N4O3S
Mol. Mass.:
450.638
SMILES:
CC(=O)Nc1cccc(c1)N1CCN(CCCCNS(=O)(=O)CC2CCCCC2)CC1
: