Target
Nuclear receptor subfamily 5 group A member 2
Ligand
BDBM50605641
Substrate
Meas. Tech.
ChEMBL_2252566 (CHEMBL5166776)
Kd
340±n/a nM
Citation
 Cato, MLCornelison, JLSpurlin, RMCourouble, VVPatel, ABFlynn, ARJohnson, AMOkafor, CDFrank, FD'Agostino, EHGriffin, PRJui, NTOrtlund, EA Differential Modulation of Nuclear Receptor LRH-1 through Targeting Buried and Surface Regions of the Binding Pocket. J Med Chem 65:6888-6902 (2022) Target
Name:
Nuclear receptor subfamily 5 group A member 2
Synonyms:
Alpha-1-fetoprotein transcription factor B1F CYP7A promoter-binding factor Hepatocytic transcription factor Liver Receptor Homolog 1 NR5A2_HUMAN hB1F | nuclear receptor subfamily 5 group A member 2 isoform 2
Type:
Nuclear Hormone Receptor
Mol. Mass.:
61341.37
Organism:
Homo sapiens (Human)
Description:
Residue:
541
  
Inhibitor
Name:
BDBM50605641
Synonyms:
CHEMBL5177743
Type:
Small organic molecule
Emp. Form.:
C32H42N2O4S
Mol. Mass.:
550.752
SMILES:
NS(=O)(=O)N[C@H]1CC[C@@]2(C1CC(CCCCCCCCCC(O)=O)=C2c1ccccc1)C(=C)c1ccccc1
: