Target
Estrogen receptor
Ligand
BDBM50187944
Substrate
Meas. Tech.
ChEMBL_383638 (CHEMBL868001)
IC50
82±n/a nM
Citation
 Wilkening, RRRatcliffe, RWFried, AKMeng, DSun, WColwell, LLambert, SGreenlee, MNilsson, SThorsell, AMojena, MTudela, CFrisch, KChan, WBirzin, ETRohrer, SPHammond, ML Estrogen receptor beta-subtype selective tetrahydrofluorenones: use of a fused pyrazole as a phenol bioisostere. Bioorg Med Chem Lett 16:3896-901 (2006)  
Target
Name:
Estrogen receptor
Synonyms:
ER ESR ESR1_HUMAN Estrogen receptor Estrogen receptor (ER-alpha) Estrogen receptor alpha (ER) Nuclear receptor subfamily 3 group A member 1
Type:
Protein
Mol. Mass.:
66230.44
Organism:
Homo sapiens (Human)
Description:
P03372
Residue:
595
  
Inhibitor
Name:
BDBM50187944
Synonyms:
(S)-6-chloro-9a-ethyl-1-fluoro-8,9,9a,10-tetrahydroindeno[2,1-e]indazol-7(3H)-one | CHEMBL211887
Type:
Small organic molecule
Emp. Form.:
C16H14ClFN2O
Mol. Mass.:
304.747
SMILES:
CC[C@]12Cc3c(ccc4[nH]nc(F)c34)C1=C(Cl)C(=O)CC2
: