Target
Estrogen receptor beta
Ligand
BDBM50187961
Substrate
Meas. Tech.
ChEMBL_383639 (CHEMBL868002)
IC50
7.7±n/a nM
Citation
 Wilkening, RRRatcliffe, RWFried, AKMeng, DSun, WColwell, LLambert, SGreenlee, MNilsson, SThorsell, AMojena, MTudela, CFrisch, KChan, WBirzin, ETRohrer, SPHammond, ML Estrogen receptor beta-subtype selective tetrahydrofluorenones: use of a fused pyrazole as a phenol bioisostere. Bioorg Med Chem Lett 16:3896-901 (2006)  
Target
Name:
Estrogen receptor beta
Synonyms:
ER-beta ESR2_HUMAN Estradiol receptor beta (ERβ) Estrogen receptor (ER beta) Estrogen receptor beta (ER beta) NR3A2 estrogen beta
Type:
Protein
Mol. Mass.:
59238.43
Organism:
Homo sapiens (Human)
Description:
Q92731
Residue:
530
  
Inhibitor
Name:
BDBM50187961
Synonyms:
(S)-6-chloro-9a-ethyl-8,9,9a,10-tetrahydroindeno[2,1-e]indazol-7(3H)-one | CHEMBL425246
Type:
Small organic molecule
Emp. Form.:
C16H15ClN2O
Mol. Mass.:
286.756
SMILES:
CC[C@]12Cc3c(ccc4[nH]ncc34)C1=C(Cl)C(=O)CC2
: