Target
Estrogen receptor beta
Ligand
BDBM50185851
Substrate
Meas. Tech.
ChEMBL_383639 (CHEMBL868002)
IC50
1.8±n/a nM
Citation
 Wilkening, RRRatcliffe, RWFried, AKMeng, DSun, WColwell, LLambert, SGreenlee, MNilsson, SThorsell, AMojena, MTudela, CFrisch, KChan, WBirzin, ETRohrer, SPHammond, ML Estrogen receptor beta-subtype selective tetrahydrofluorenones: use of a fused pyrazole as a phenol bioisostere. Bioorg Med Chem Lett 16:3896-901 (2006)  
Target
Name:
Estrogen receptor beta
Synonyms:
ER-beta ESR2_HUMAN Estradiol receptor beta (ERβ) Estrogen receptor (ER beta) Estrogen receptor beta (ER beta) NR3A2 estrogen beta
Type:
Protein
Mol. Mass.:
59238.43
Organism:
Homo sapiens (Human)
Description:
Q92731
Residue:
530
  
Inhibitor
Name:
BDBM50185851
Synonyms:
(R,S)-4-bromo-9a-butyl-7-hydroxy-1,2,9,9a-tetrahydrofluoren-3-one rac-4-bromo-9a-butyl-7-hydroxy-1,2,9,9a-tetrahydrofluoren-3-one
Type:
Small organic molecule
Emp. Form.:
C17H19BrO2
Mol. Mass.:
335.236
SMILES:
CCCCC12Cc3cc(O)ccc3C1=C(Br)C(=O)CC2
: