Target
Estrogen receptor
Ligand
BDBM50187966
Substrate
Meas. Tech.
ChEMBL_383638 (CHEMBL868001)
IC50
229±n/a nM
Citation
 Wilkening, RRRatcliffe, RWFried, AKMeng, DSun, WColwell, LLambert, SGreenlee, MNilsson, SThorsell, AMojena, MTudela, CFrisch, KChan, WBirzin, ETRohrer, SPHammond, ML Estrogen receptor beta-subtype selective tetrahydrofluorenones: use of a fused pyrazole as a phenol bioisostere. Bioorg Med Chem Lett 16:3896-901 (2006)  
Target
Name:
Estrogen receptor
Synonyms:
ER ESR ESR1_HUMAN Estrogen receptor Estrogen receptor (ER-alpha) Estrogen receptor alpha (ER) Nuclear receptor subfamily 3 group A member 1
Type:
Protein
Mol. Mass.:
66230.44
Organism:
Homo sapiens (Human)
Description:
P03372
Residue:
595
  
Inhibitor
Name:
BDBM50187966
Synonyms:
(S)-6-bromo-9a-(2-cyclopropyl-ethyl)-8,9,9a,10-tetrahydro-3H-2,3-diaza-cyclopenta[a]fluoren-7-one | CHEMBL211800
Type:
Small organic molecule
Emp. Form.:
C19H19BrN2O
Mol. Mass.:
371.271
SMILES:
BrC1=C2c3ccc4[nH]ncc4c3C[C@]2(CCC2CC2)CCC1=O
: