Target
Estrogen receptor beta
Ligand
BDBM50187968
Substrate
Meas. Tech.
ChEMBL_383639 (CHEMBL868002)
IC50
1±n/a nM
Citation
 Wilkening, RRRatcliffe, RWFried, AKMeng, DSun, WColwell, LLambert, SGreenlee, MNilsson, SThorsell, AMojena, MTudela, CFrisch, KChan, WBirzin, ETRohrer, SPHammond, ML Estrogen receptor beta-subtype selective tetrahydrofluorenones: use of a fused pyrazole as a phenol bioisostere. Bioorg Med Chem Lett 16:3896-901 (2006)  
Target
Name:
Estrogen receptor beta
Synonyms:
ER-beta ESR2_HUMAN Estradiol receptor beta (ERβ) Estrogen receptor (ER beta) Estrogen receptor beta (ER beta) NR3A2 estrogen beta
Type:
Protein
Mol. Mass.:
59238.43
Organism:
Homo sapiens (Human)
Description:
Q92731
Residue:
530
  
Inhibitor
Name:
BDBM50187968
Synonyms:
(S)-9a-butyl-1-fluoro-6-(trifluoromethyl)-8,9,9a,10-tetrahydroindeno[2,1-e]indazol-7(3H)-one | CHEMBL384268
Type:
Small organic molecule
Emp. Form.:
C19H18F4N2O
Mol. Mass.:
366.3526
SMILES:
CCCC[C@]12Cc3c(ccc4n[nH]c(F)c34)C1=C(C(=O)CC2)C(F)(F)F
: