Target
Estrogen receptor beta
Ligand
BDBM50187972
Substrate
Meas. Tech.
ChEMBL_383639 (CHEMBL868002)
IC50
4.1±n/a nM
Citation
 Wilkening, RRRatcliffe, RWFried, AKMeng, DSun, WColwell, LLambert, SGreenlee, MNilsson, SThorsell, AMojena, MTudela, CFrisch, KChan, WBirzin, ETRohrer, SPHammond, ML Estrogen receptor beta-subtype selective tetrahydrofluorenones: use of a fused pyrazole as a phenol bioisostere. Bioorg Med Chem Lett 16:3896-901 (2006)  
Target
Name:
Estrogen receptor beta
Synonyms:
ER-beta ESR2_HUMAN Estradiol receptor beta (ERβ) Estrogen receptor (ER beta) Estrogen receptor beta (ER beta) NR3A2 estrogen beta
Type:
Protein
Mol. Mass.:
59238.43
Organism:
Homo sapiens (Human)
Description:
Q92731
Residue:
530
  
Inhibitor
Name:
BDBM50187972
Synonyms:
(R)-6-chloro-9a-ethyl-9,9a-dihydroindeno[2,1-e]indazole-7,10(3H,8H)-dione | CHEMBL377254
Type:
Small organic molecule
Emp. Form.:
C16H13ClN2O2
Mol. Mass.:
300.74
SMILES:
CC[C@@]12CCC(=O)C(Cl)=C1c1ccc3[nH]ncc3c1C2=O
: