Target
Estrogen receptor beta
Ligand
BDBM50187946
Substrate
Meas. Tech.
ChEMBL_383639 (CHEMBL868002)
IC50
12.6±n/a nM
Citation
 Wilkening, RRRatcliffe, RWFried, AKMeng, DSun, WColwell, LLambert, SGreenlee, MNilsson, SThorsell, AMojena, MTudela, CFrisch, KChan, WBirzin, ETRohrer, SPHammond, ML Estrogen receptor beta-subtype selective tetrahydrofluorenones: use of a fused pyrazole as a phenol bioisostere. Bioorg Med Chem Lett 16:3896-901 (2006)  
Target
Name:
Estrogen receptor beta
Synonyms:
ER-beta ESR2_HUMAN Estradiol receptor beta (ERβ) Estrogen receptor (ER beta) Estrogen receptor beta (ER beta) NR3A2 estrogen beta
Type:
Protein
Mol. Mass.:
59238.43
Organism:
Homo sapiens (Human)
Description:
Q92731
Residue:
530
  
Inhibitor
Name:
BDBM50187946
Synonyms:
CHEMBL377171 | rac-6-methyl-9a-propyl-8,9,9a,10-tetrahydroindeno[2,1-e]indazol-7(3H)-one
Type:
Small organic molecule
Emp. Form.:
C18H20N2O
Mol. Mass.:
280.3642
SMILES:
CCCC12Cc3c(ccc4[nH]ncc34)C1=C(C)C(=O)CC2
: