Target
Estrogen receptor beta
Ligand
BDBM50187952
Substrate
Meas. Tech.
ChEMBL_383639 (CHEMBL868002)
IC50
207±n/a nM
Citation
 Wilkening, RRRatcliffe, RWFried, AKMeng, DSun, WColwell, LLambert, SGreenlee, MNilsson, SThorsell, AMojena, MTudela, CFrisch, KChan, WBirzin, ETRohrer, SPHammond, ML Estrogen receptor beta-subtype selective tetrahydrofluorenones: use of a fused pyrazole as a phenol bioisostere. Bioorg Med Chem Lett 16:3896-901 (2006)  
Target
Name:
Estrogen receptor beta
Synonyms:
ER-beta ESR2_HUMAN Estradiol receptor beta (ERβ) Estrogen receptor (ER beta) Estrogen receptor beta (ER beta) NR3A2 estrogen beta
Type:
Protein
Mol. Mass.:
59238.43
Organism:
Homo sapiens (Human)
Description:
Q92731
Residue:
530
  
Inhibitor
Name:
BDBM50187952
Synonyms:
CHEMBL209650 | rac-methyl 9a-ethyl-7-oxo-3,7,8,9,9a,10-hexahydroindeno[2,1-e]indazole-6-carboxylate
Type:
Small organic molecule
Emp. Form.:
C18H18N2O3
Mol. Mass.:
310.3471
SMILES:
CCC12Cc3c(ccc4[nH]ncc34)C1=C(C(=O)OC)C(=O)CC2
: