Target
Peroxisome proliferator-activated receptor alpha
Ligand
BDBM50188028
Substrate
Meas. Tech.
ChEMBL_389967 (CHEMBL864209)
IC50
125±n/a nM
Citation
 Kuhn, BHilpert, HBenz, JBinggeli, AGrether, UHumm, RMärki, HPMeyer, MMohr, P Structure-based design of indole propionic acids as novel PPARalpha/gamma co-agonists. Bioorg Med Chem Lett 16:4016-20 (2006)  
Target
Name:
Peroxisome proliferator-activated receptor alpha
Synonyms:
NR1C1 PPAR PPAR-alpha PPARA_HUMAN Peroxisome proliferator-activated receptor | Peroxisome proliferator-activated receptor alpha (PPAR alpha)
Type:
Enzyme
Mol. Mass.:
52222.08
Organism:
Homo sapiens (Human)
Description:
Q07869
Residue:
468
  
Inhibitor
Name:
BDBM50188028
Synonyms:
2-ethoxy-3-(1-((5-methyl-2-o-tolyloxazol-4-yl)methyl)-1H-indol-5-yl)propanoic acid | CHEMBL211371
Type:
Small organic molecule
Emp. Form.:
C25H26N2O4
Mol. Mass.:
418.4849
SMILES:
CCOC(Cc1ccc2n(Cc3nc(oc3C)-c3ccccc3C)ccc2c1)C(O)=O
: