Target
Thromboxane A2 receptor
Ligand
BDBM50188620
Substrate
Meas. Tech.
ChEMBL_364279 (CHEMBL863217)
IC50
81.22±n/a nM
Citation
 Hanson, JReynaud, DQiao, NDevel, PMoray, ALRenard, JFKelley, LPWinum, JYMontero, JLKinsella, BTPirotte, BPace-Asciak, CRDogné, JM Synthesis and pharmacological evaluation of novel nitrobenzenic thromboxane modulators as antiplatelet agents acting on both the alpha and beta isoforms of the human thromboxane receptor. J Med Chem 49:3701-9 (2006)  
Target
Name:
Thromboxane A2 receptor
Synonyms:
Prostanoid TP receptor TBXA2R Thromboxane Thromboxane Beta
Type:
Enyzme
Mol. Mass.:
37445.28
Organism:
Homo sapiens (Human)
Description:
P21731
Residue:
343
  
Inhibitor
Name:
BDBM50188620
Synonyms:
CHEMBL379736 | N-n-hexyl-N'-[2-(cyclohexylamino)-5-nitrobenzenesulfonyl]urea
Type:
Small organic molecule
Emp. Form.:
C19H30N4O5S
Mol. Mass.:
426.53
SMILES:
CCCCCCNC(=O)NS(=O)(=O)c1cc(ccc1NC1CCCCC1)[N+]([O-])=O
: