Target
Egl nine homolog 1
Ligand
BDBM107704
Substrate
Meas. Tech.
ChEMBL_2260672 (CHEMBL5215683)
IC50
29±n/a nM
Citation
 Wu, YLi, ZMcDonough, MASchofield, CJZhang, X Inhibition of the Oxygen-Sensing Asparaginyl Hydroxylase Factor Inhibiting Hypoxia-Inducible Factor: A Potential Hypoxia Response Modulating Strategy. J Med Chem 64:7189-7209 (2021) Target
Name:
Egl nine homolog 1
Synonyms:
C1orf12 EGLN1_HUMAN Hypoxia-inducible factor prolyl hydroxylase 2 (HIF-PH2) Prolyl hydroxylase domain-containing protein 2 (PHD2)
Type:
Protein
Mol. Mass.:
46035.59
Organism:
Homo sapiens (Human)
Description:
Q9GZT9
Residue:
426
  
Inhibitor
Name:
BDBM107704
Synonyms:
US11426393, Compound Table XV.11 US8598210, Table XV, 10 US8722895, 10: {[5-(3-Chlorophenyl)-3-hydroxypyridine-2- carbonyl]amino}-acetic acid trifluoroacetic acid salt US9598370, Example 00136 | USRE47437, Example {[5-(3-Chlorophenyl)-3-hydroxypyridine-2-carbonyl]amino}-acetic acid
Type:
Small organic molecule
Emp. Form.:
C14H11ClN2O4
Mol. Mass.:
306.701
SMILES:
OC(=O)CNC(=O)c1ncc(cc1O)-c1cccc(Cl)c1
: