Target
Neuronal acetylcholine receptor; alpha9/alpha10
Ligand
BDBM50606633
Substrate
Meas. Tech.
ChEMBL_2260838 (CHEMBL5215849)
IC50
0.050000±n/a nM
Citation
 Gajewiak, JChristensen, SBDowell, CHararah, FFisher, FHuynh, PNOlivera, BMMcIntosh, JM Selective Penicillamine Substitution Enables Development of a Potent Analgesic Peptide that Acts through a Non-Opioid-Based Mechanism. J Med Chem 64:9271-9278 (2021) Target
Name:
Neuronal acetylcholine receptor; alpha9/alpha10
Synonyms:
Neuronal acetylcholine receptor protein alpha-10/alpha-9 subunit | Neuronal acetylcholine receptor subunit alpha-10/alpha-9
Type:
Mol. Mass.:
Description:
ASSAY_ID of ChEMBL is 2150170
Components:
This complex has 2 components.
Component 1
Name:
Neuronal acetylcholine receptor subunit alpha-9
Synonyms:
ACHA9_HUMAN NACHR alpha-9 Neuronal acetylcholine receptor protein alpha-9 subunit Nicotinic acetylcholine receptor subunit alpha-9
Type:
PROTEIN
Mol. Mass.:
54806.10
Organism:
Homo sapiens (Human)
Description:
ChEMBL_306102
Residue:
479
  
Component 2
Name:
Neuronal acetylcholine receptor subunit alpha-10
Synonyms:
ACH10_HUMAN NACHRA10 | Neuronal acetylcholine receptor protein alpha-10 subunit
Type:
PROTEIN
Mol. Mass.:
49714.45
Organism:
Homo sapiens (Human)
Description:
EBI_12740
Residue:
450
  
Inhibitor
Name:
BDBM50606633
Synonyms:
CHEMBL5219936
Type:
Small organic molecule
Emp. Form.:
C71H109IN24O20S4
Mol. Mass.:
1873.938
SMILES:
[H][C@@]12CCCN1C(=O)[C@H](CC(O)=O)NC(=O)[C@@H](NC(=O)[C@H]1NC(=O)[C@@H](CSSC[C@H](NC(=O)[C@H](CCCNC(N)=N)NC2=O)C(=O)N[C@@H](CCCNC(N)=N)C(=O)N[C@@H](Cc2ccc(O)c(I)c2)C(=O)N[C@@H](CCCN)C(=O)N[C@@H](CSSC1(C)C)C(=O)N[C@H](CC(=O)N[C@@H](CCCNC(N)=N)C(O)=O)Cc1ccc(O)cc1)NC(=O)CN)[C@@H](C)O
: