Target
Fatty acid synthase
Ligand
BDBM50189473
Substrate
Meas. Tech.
ChEMBL_404787 (CHEMBL869274)
IC50
68±n/a nM
Citation
 Rivkin, AKim, YRGoulet, MTBays, NHill, ADKariv, IKrauss, SGinanni, NStrack, PRKohl, NEChung, CCVarnerin, JPGoudreau, PNChang, ATota, MRMunoz, B 3-Aryl-4-hydroxyquinolin-2(1H)-one derivatives as type I fatty acid synthase inhibitors. Bioorg Med Chem Lett 16:4620-3 (2006)  
Target
Name:
Fatty acid synthase
Synonyms:
FAS FAS_HUMAN HU FASN
Type:
Enzyme
Mol. Mass.:
273419.37
Organism:
Homo sapiens (Human)
Description:
P49327
Residue:
2511
  
Inhibitor
Name:
BDBM50189473
Synonyms:
7-chloro-3-(3',4'-difluoro-biphenyl-3-yl)-4-hydroxy-2-oxo-1,2-dihydro-quinoline-6-carbonitrile | CHEMBL213583
Type:
Small organic molecule
Emp. Form.:
C22H11ClF2N2O2
Mol. Mass.:
408.785
SMILES:
Oc1c(-c2cccc(c2)-c2ccc(F)c(F)c2)c(=O)[nH]c2cc(Cl)c(cc12)C#N
: