Target
Angiotensin-converting enzyme
Ligand
BDBM50017125
Substrate
Meas. Tech.
ChEMBL_405832 (CHEMBL869864)
Ki
51±n/a nM
Citation
 Nchinda, ATChibale, KRedelinghuys, PSturrock, ED Synthesis of novel keto-ACE analogues as domain-selective angiotensin I-converting enzyme inhibitors. Bioorg Med Chem Lett 16:4612-5 (2006)  
Target
Name:
Angiotensin-converting enzyme
Synonyms:
3.2.1.- ACE Angiotensin-converting enzyme, soluble form DCP1 Kininase II
Type:
Mol. Mass.:
150405.15
Organism:
Oryctolagus cuniculus
Description:
Residue:
1310
  
Inhibitor
Name:
BDBM50017125
Synonyms:
1-[6-Amino-2-(1-carboxy-3-phenyl-propylamino)-hexanoyl]-pyrrolidine-2-carboxylic acid; hydrate ( Lisinopril) CHEMBL1237 | CHEMBL295690
Type:
Small organic molecule
Emp. Form.:
C23H33N3O5S2
Mol. Mass.:
495.655
SMILES:
NCCCC[C@H](N[C@@H](CCc1ccccc1)C(O)=O)C(=O)N1CC2(C[C@H]1C(O)=O)SCCS2
: