Target
Glycogen synthase kinase-3
Ligand
BDBM50189603
Substrate
Meas. Tech.
ChEMBL_368581 (CHEMBL866825)
IC50
>5000±n/a nM
Citation
 Borzilleri, RMBhide, RSBarrish, JCD'Arienzo, CJDerbin, GMFargnoli, JHunt, JTJeyaseelan, RKamath, AKukral, DWMarathe, PMortillo, SQian, LTokarski, JSWautlet, BSZheng, XLombardo, LJ Discovery and evaluation of N-cyclopropyl- 2,4-difluoro-5-((2-(pyridin-2-ylamino)thiazol-5- ylmethyl)amino)benzamide (BMS-605541), a selective and orally efficacious inhibitor of vascular endothelial growth factor receptor-2. J Med Chem 49:3766-9 (2006)  
Target
Name:
Glycogen synthase kinase-3
Synonyms:
Glycogen synthase kinase-3 alpha/beta
Type:
Mol. Mass.:
Description:
ASSAY_ID of ChEMBL is 2193535
Components:
This complex has 2 components.
Component 1
Name:
Glycogen synthase kinase-3 alpha
Synonyms:
GSK-3 alpha GSK3A_HUMAN Glycogen synthase kinase-3 Glycogen synthase kinase-3 alpha (GSK3 Alpha) Glycogen synthase kinase-3 alpha (GSK3alpha)
Type:
Enzyme
Mol. Mass.:
50991.79
Organism:
Homo sapiens (Human)
Description:
P49840
Residue:
483
  
Component 2
Name:
Glycogen synthase kinase-3 beta
Synonyms:
GSK-3 beta GSK3B Glycogen synthase kinase 3 beta (GSK3B) Glycogen synthase kinase-3 beta (GSK-3B) Glycogen synthase kinase-3 beta (GSK3B) Glycogen synthase kinase-3beta (GSK3B) | Serine/threonine-protein kinase GSK3B
Type:
Enzyme
Mol. Mass.:
46756.38
Organism:
Homo sapiens (Human)
Description:
P49841
Residue:
420
  
Inhibitor
Name:
BDBM50189603
Synonyms:
CHEMBL377734 | N-cyclopropyl-2,4-difluoro-5-((2-(pyridin-2-ylamino)thiazol-5-yl)methylamino)benzamide
Type:
Small organic molecule
Emp. Form.:
C19H17F2N5OS
Mol. Mass.:
401.433
SMILES:
Fc1cc(F)c(cc1NCc1cnc(Nc2ccccn2)s1)C(=O)NC1CC1
: