Target
RAC-alpha/RAC-beta/RAC-gamma serine/threonine-protein kinase
Ligand
BDBM50189603
Substrate
Meas. Tech.
ChEMBL_368583 (CHEMBL866827)
IC50
>5000±n/a nM
Citation
 Borzilleri, RMBhide, RSBarrish, JCD'Arienzo, CJDerbin, GMFargnoli, JHunt, JTJeyaseelan, RKamath, AKukral, DWMarathe, PMortillo, SQian, LTokarski, JSWautlet, BSZheng, XLombardo, LJ Discovery and evaluation of N-cyclopropyl- 2,4-difluoro-5-((2-(pyridin-2-ylamino)thiazol-5- ylmethyl)amino)benzamide (BMS-605541), a selective and orally efficacious inhibitor of vascular endothelial growth factor receptor-2. J Med Chem 49:3766-9 (2006)  
Target
Name:
RAC-alpha/RAC-beta/RAC-gamma serine/threonine-protein kinase
Synonyms:
Serine/threonine-protein kinase AKT
Type:
Mol. Mass.:
Description:
ASSAY_ID of ChEMBL is 30507
Components:
This complex has 3 components.
Component 1
Name:
RAC-beta serine/threonine-protein kinase
Synonyms:
AKT2 PKB beta Protein kinase B (Akt 2) Protein kinase B, beta RAC-alpha serine/threonine-protein kinase (AKT2) RAC-beta serine/threonine-protein kinase (AKT2) Serine/threonine-protein kinase AKT2 | Serine/threonine-protein kinase Rac alpha/beta
Type:
Enzyme
Mol. Mass.:
55766.64
Organism:
Homo sapiens (Human)
Description:
Residue:
481
  
Component 2
Name:
RAC-gamma serine/threonine-protein kinase
Synonyms:
AKT3 PKB gamma Protein kinase Akt-3 Protein kinase B, gamma RAC-gamma serine/threonine-protein kinase Serine/threonine-protein kinase AKT | Serine/threonine-protein kinase AKT3
Type:
Enzyme
Mol. Mass.:
55769.36
Organism:
Homo sapiens (Human)
Description:
Residue:
479
  
Component 3
Name:
RAC-alpha serine/threonine-protein kinase
Synonyms:
AKT phosphorylation (p-AKT) AKT1/PPP1CA C-AKT PKB alpha Protein kinase B Protein kinase B (Akt 1) Protein kinase B alpha Proto-oncogene Akt (Akt1) Proto-oncogene c-Akt (AKT1) RAC-PK-alpha RAC-alpha serine/threonine-protein kinase (AKT1) | RAC-alpha serine/threonine-protein kinase (pAKT)
Type:
Enzyme
Mol. Mass.:
55681.25
Organism:
Homo sapiens (Human)
Description:
P31749
Residue:
480
  
Inhibitor
Name:
BDBM50189603
Synonyms:
CHEMBL377734 | N-cyclopropyl-2,4-difluoro-5-((2-(pyridin-2-ylamino)thiazol-5-yl)methylamino)benzamide
Type:
Small organic molecule
Emp. Form.:
C19H17F2N5OS
Mol. Mass.:
401.433
SMILES:
Fc1cc(F)c(cc1NCc1cnc(Nc2ccccn2)s1)C(=O)NC1CC1
: