Target
Tyrosine-protein kinase ITK/TSK
Ligand
BDBM50189603
Substrate
Meas. Tech.
ChEMBL_368596 (CHEMBL866180)
IC50
>50000±n/a nM
Citation
 Borzilleri, RMBhide, RSBarrish, JCD'Arienzo, CJDerbin, GMFargnoli, JHunt, JTJeyaseelan, RKamath, AKukral, DWMarathe, PMortillo, SQian, LTokarski, JSWautlet, BSZheng, XLombardo, LJ Discovery and evaluation of N-cyclopropyl- 2,4-difluoro-5-((2-(pyridin-2-ylamino)thiazol-5- ylmethyl)amino)benzamide (BMS-605541), a selective and orally efficacious inhibitor of vascular endothelial growth factor receptor-2. J Med Chem 49:3766-9 (2006)  
Target
Name:
Tyrosine-protein kinase ITK/TSK
Synonyms:
EMT ITK_HUMAN LYK Tyrosine-protein kinase ITK Tyrosine-protein kinase Lyk
Type:
Protein
Mol. Mass.:
71839.20
Organism:
Homo sapiens (Human)
Description:
Q08881
Residue:
620
  
Inhibitor
Name:
BDBM50189603
Synonyms:
CHEMBL377734 | N-cyclopropyl-2,4-difluoro-5-((2-(pyridin-2-ylamino)thiazol-5-yl)methylamino)benzamide
Type:
Small organic molecule
Emp. Form.:
C19H17F2N5OS
Mol. Mass.:
401.433
SMILES:
Fc1cc(F)c(cc1NCc1cnc(Nc2ccccn2)s1)C(=O)NC1CC1
: