Target
Prostaglandin G/H synthase 2
Ligand
BDBM50189989
Substrate
Meas. Tech.
ChEMBL_391094 (CHEMBL869874)
IC50
1.9±n/a nM
Citation
 Navidpour, LAmini, MShafaroodi, HAbdi, KGhahremani, MHDehpour, ARShafiee, A Design and synthesis of new water-soluble tetrazolide derivatives of celecoxib and rofecoxib as selective cyclooxygenase-2 (COX-2) inhibitors. Bioorg Med Chem Lett 16:4483-7 (2006)  
Target
Name:
Prostaglandin G/H synthase 2
Synonyms:
COX2 Cyclooxygenase 2 (COX-2) Cyclooxygenase-2 (COX-2 AA) Cyclooxygenase-2 (COX-2) PGH2_HUMAN PHS II Prostaglandin E synthase/G/H synthase 2 Prostaglandin-endoperoxide synthase 2
Type:
Enzyme
Mol. Mass.:
69003.89
Organism:
Homo sapiens (Human)
Description:
Recombinant Cox-2 provided by Cayman (Cayman Chemical Co.,Ann Arbor, MI).
Residue:
604
  
Inhibitor
Name:
BDBM50189989
Synonyms:
4-(4-methylphenyl)-1-[4-(5-tetrazolyl)phenyl]-3-(trifluoromethyl)-1H-pyrazole | CHEMBL213338
Type:
Small organic molecule
Emp. Form.:
C18H13F3N6
Mol. Mass.:
370.3312
SMILES:
Cc1ccc(cc1)-c1cc(nn1-c1ccc(cc1)-c1nnn[nH]1)C(F)(F)F
: