Target
Amine oxidase [flavin-containing] A
Ligand
BDBM11022
Substrate
Meas. Tech.
ChEMBL_2261992 (CHEMBL5217003)
IC50
8430±n/a nM
Citation
 Hitge, RPetzer, APetzer, JP Isatoic anhydrides as novel inhibitors of monoamine oxidase. Bioorg Med Chem 73:0 (2022) Target
Name:
Amine oxidase [flavin-containing] A
Synonyms:
AOFA_HUMAN MAO-A Monoamine oxidase Monoamine oxidase type A (MAO A) Monoamine oxidase type A (MAOA)
Type:
Protein
Mol. Mass.:
59689.53
Organism:
Homo sapiens (Human)
Description:
P21397
Residue:
527
  
Inhibitor
Name:
BDBM11022
Synonyms:
2,3-dihydro-1H-indole-2,3-dione Isatin | Isatin (Compound 1)
Type:
Small organic molecule
Emp. Form.:
C8H5NO2
Mol. Mass.:
147.1308
SMILES:
O=C1Nc2ccccc2C1=O
: