Target
D(2) dopamine receptor
Ligand
BDBM50190218
Substrate
Meas. Tech.
ChEMBL_391332 (CHEMBL870468)
Ki
647±n/a nM
Citation
 Sasikumar, TKBurnett, DAZhang, HSmith-Torhan, AFawzi, ALachowicz, JE Hydrazides of clozapine: a new class of D1 dopamine receptor subtype selective antagonists. Bioorg Med Chem Lett 16:4543-7 (2006)  
Target
Name:
D(2) dopamine receptor
Synonyms:
D(2) dopamine receptor DOPAMINE D2 Long DRD2 Dopamine D2 receptor Dopamine D2 receptor (D2R) Dopamine2-like | d2
Type:
Cell-surface receptors
Mol. Mass.:
50647.10
Organism:
Homo sapiens (Human)
Description:
P14416
Residue:
443
  
Inhibitor
Name:
BDBM50190218
Synonyms:
8-chloro-11-(4-methyl-piperazin-1-yl)-dibenzo[b,e][1,4]diazepin-5-ylamine | CHEMBL215140
Type:
Small organic molecule
Emp. Form.:
C18H20ClN5
Mol. Mass.:
341.838
SMILES:
CN1CCN(CC1)C1=Nc2cc(Cl)ccc2N(N)c2ccccc12
: