Target
Adenosine receptor A2b
Ligand
BDBM50190709
Substrate
Meas. Tech.
ChEMBL_369247 (CHEMBL864165)
Ki
3.6±n/a nM
Citation
 Yan, LBertarelli, DCHayallah, AMMeyer, HKlotz, KNMüller, CE A new synthesis of sulfonamides by aminolysis of p-nitrophenylsulfonates yielding potent and selective adenosine A2B receptor antagonists. J Med Chem 49:4384-91 (2006)  
Target
Name:
Adenosine receptor A2b
Synonyms:
AA2BR_HUMAN ADORA2B Adenosine receptors A2b | Adenosine receptors; A2a & A2b
Type:
G Protein-Coupled Receptor (GPCR)
Mol. Mass.:
36341.22
Organism:
Homo sapiens (Human)
Description:
Residue:
332
  
Inhibitor
Name:
BDBM50190709
Synonyms:
8-(4-(4-benzylpiperazin-1-ylsulfonyl)phenyl)-1-propyl-1H-purine-2,6(3H,7H)-dione CHEMBL212625
Type:
Small organic molecule
Emp. Form.:
C25H28N6O4S
Mol. Mass.:
508.593
SMILES:
CCCn1c(=O)[nH]c2nc([nH]c2c1=O)-c1ccc(cc1)S(=O)(=O)N1CCN(Cc2ccccc2)CC1
: