Target
Histone acetyltransferase p300
Ligand
BDBM50607586
Substrate
Meas. Tech.
ChEMBL_2262983 (CHEMBL5217994)
IC50
0.794328±n/a nM
Citation
 Tian, XSuarez, DThomson, DLi, WKing, EALaFrance, LBoehm, JBarton, LDi Marco, CMartyr, CThalji, RMedina, JKnight, SHeerding, DGao, ENartey, ECecconie, TNixon, CZhang, GBerrodin, TJPhelps, CPatel, ABai, XLind, KPrabhu, NMesser, JZhu, ZShewchuk, LReid, RGraves, APMcHugh, CMangatt, B Discovery of Proline-Based p300/CBP Inhibitors Using DNA-Encoded Library Technology in Combination with High-Throughput Screening. J Med Chem 65:14391-14408 (2022) Target
Name:
Histone acetyltransferase p300
Synonyms:
EP300 HIF1A/p300/CREB-binding protein P300
Type:
Protein
Mol. Mass.:
264223.04
Organism:
Homo sapiens (Human)
Description:
Q09472
Residue:
2414
  
Inhibitor
Name:
BDBM50607586
Synonyms:
CHEMBL5221030
Type:
Small organic molecule
Emp. Form.:
C25H28ClN3O3
Mol. Mass.:
453.961
SMILES:
CNC(=O)c1ccc(NC(=O)[C@H]2CCCN2C(=O)C2(CCCC2)c2cccc(Cl)c2)cc1
: